第七色在线视频,2021少妇久久久久久久久久,亚洲欧洲精品成人久久av18,亚洲国产精品特色大片观看完整版,孙宇晨将参加特朗普的晚宴

為了賬號(hào)安全,請(qǐng)及時(shí)綁定郵箱和手機(jī)立即綁定

AreaDaoTest進(jìn)行測(cè)試時(shí)候,一直報(bào)這個(gè)問(wèn)題

Error starting ApplicationContext. To display the conditions report re-run your application with 'debug' enabled.

2018-05-22 15:08:46.636 ERROR 16648 --- [? ? ? ? ? ?main] o.s.boot.SpringApplication? ? ? ? ? ? ? ?: Application run failed


org.springframework.beans.factory.BeanCreationException: Error creating bean with name 'areaServiceImpl': Injection of resource dependencies failed; nested exception is org.springframework.beans.factory.UnsatisfiedDependencyException: Error creating bean with name 'areaDao' defined in file [E:\env\ideaProjects\study\demo\target\classes\com\zx\demo\dao\AreaDao.class]: Unsatisfied dependency expressed through bean property 'sqlSessionFactory'; nested exception is org.springframework.beans.factory.BeanCreationException: Error creating bean with name 'sqlSessionFactory' defined in class path resource [com/zx/demo/config/dao/SessionFactoryConfiguration.class]: Invocation of init method failed; nested exception is org.springframework.core.NestedIOException: Failed to parse config resource: class path resource [mybatis-config.xml]; nested exception is org.apache.ibatis.builder.BuilderException: Error parsing SQL Mapper Configuration. Cause: org.apache.ibatis.builder.BuilderException: The setting useColumnLable is not known.? Make sure you spelled it correctly (case sensitive).

at org.springframework.context.annotation.CommonAnnotationBeanPostProcessor.postProcessPropertyValues(CommonAnnotationBeanPostProcessor.java:321) ~[spring-context-5.0.6.RELEASE.jar:5.0.6.RELEASE]

at org.springframework.beans.factory.support.AbstractAutowireCapableBeanFactory.populateBean(AbstractAutowireCapableBeanFactory.java:1348) ~[spring-beans-5.0.6.RELEASE.jar:5.0.6.RELEASE]

at org.springframework.beans.factory.support.AbstractAutowireCapableBeanFactory.doCreateBean(AbstractAutowireCapableBeanFactory.java:578) ~[spring-beans-5.0.6.RELEASE.jar:5.0.6.RELEASE]

at org.springframework.beans.factory.support.AbstractAutowireCapableBeanFactory.createBean(AbstractAutowireCapableBeanFactory.java:501) ~[spring-beans-5.0.6.RELEASE.jar:5.0.6.RELEASE]

at org.springframework.beans.factory.support.AbstractBeanFactory.lambda$doGetBean$0(AbstractBeanFactory.java:317) ~[spring-beans-5.0.6.RELEASE.jar:5.0.6.RELEASE]

at org.springframework.beans.factory.support.DefaultSingletonBeanRegistry.getSingleton(DefaultSingletonBeanRegistry.java:228) ~[spring-beans-5.0.6.RELEASE.jar:5.0.6.RELEASE]

at org.springframework.beans.factory.support.AbstractBeanFactory.doGetBean(AbstractBeanFactory.java:315) ~[spring-beans-5.0.6.RELEASE.jar:5.0.6.RELEASE]

at org.spr


最后發(fā)現(xiàn)maven install 報(bào)錯(cuò),如下

[INFO] Total time: 7.042s

[INFO] Finished at: Tue May 22 17:18:56 CST 2018

[INFO] Final Memory: 20M/226M

[INFO] ------------------------------------------------------------------------

[ERROR] Failed to execute goal org.apache.maven.plugins:maven-surefire-plugin:2.21.0:test (default-test) on project demo: There are test failures.

[ERROR]?

[ERROR] Please refer to E:\env\ideaProjects\study\demo\target\surefire-reports for the individual test results.

[ERROR] Please refer to dump files (if any exist) [date]-jvmRun[N].dump, [date].dumpstream and [date]-jvmRun[N].dumpstream.

[ERROR] -> [Help 1]

[ERROR]?

[ERROR] To see the full stack trace of the errors, re-run Maven with the -e switch.

[ERROR] Re-run Maven using the -X switch to enable full debug logging.

[ERROR]?

[ERROR] For more information about the errors and possible solutions, please read the following articles:

[ERROR] [Help 1] http://cwiki.apache.org/confluence/display/MAVEN/MojoFailureException


正在回答

1 回答

解決了么 我和你報(bào)了一樣的錯(cuò)誤

0 回復(fù) 有任何疑惑可以回復(fù)我~

舉報(bào)

0/150
提交
取消

AreaDaoTest進(jìn)行測(cè)試時(shí)候,一直報(bào)這個(gè)問(wèn)題

我要回答 關(guān)注問(wèn)題
微信客服

購(gòu)課補(bǔ)貼
聯(lián)系客服咨詢優(yōu)惠詳情

幫助反饋 APP下載

慕課網(wǎng)APP
您的移動(dòng)學(xué)習(xí)伙伴

公眾號(hào)

掃描二維碼
關(guān)注慕課網(wǎng)微信公眾號(hào)